{"text_format":"1","workbook":"xlsx","n_sheets":15,"sheets":["Introduction","NOx Limits Summary","VOCs Limits Summary","RACT summary","Boilers_Coal","Boilers_Nat_Gas","Boilers_Oil","Combustion_Gas_Turbines","IC_Engines","NOx_MWC","Cement_Kilns","Hot_Mix_Asphalt_Production","Glass_Furnaces","NatGas_Pipeline_Compressors","VOCs"],"not_rendered":{"charts":0,"images":4,"macros":1,"external_links":0,"defined_names":20,"comments":4,"pivot_tables":0},"unopened":[],"bounds":{"document_bytes":16777216,"sheet_cells":100000,"rows_first":2000,"rows_last":500,"rows_between":2000,"halvings":0,"cell_chars":16384,"cell_head_chars":4096},"cells_cut":0,"cells_raw":0,"read":"whole","date_system":"1900"}

{"sheet":"Introduction","index":0,"n_rows":0,"n_cols":0,"rows_kept":0,"cut":false,"hidden":false,"merged":[]}

{"sheet":"NOx Limits Summary","index":1,"n_rows":24,"n_cols":15,"rows_kept":24,"cut":false,"hidden":false,"merged":[[17,5,18,5],[13,5,14,5],[15,5,16,5],[13,4,20,4],[21,4,23,5],[19,5,20,5],[1,4,6,4],[1,5,2,5],[3,5,4,5],[5,5,6,5],[7,4,12,4],[7,5,8,5],[9,5,10,5],[11,5,12,5]]}
[null,null,null,null,"Source","Size/Facility","Item","CT","DC","MD","MA","NJ","NY","PA","RI"]
[null,null,null,null,"Coal Boilers","50-100 (mmBtu/hr)","NOx Limit",{"$f":"_xlfn.IFNA(VLOOKUP(\"CT\",Boilers_Coal!$A$9:$H$60,3),\"N/A\")","v":" 0.28 lb/MMBtu (Through May 30, 2023),  0.12 lb/MMBtu (Beginning June 1, 2023).  Ozone season and non-ozone season limits also apply.  "},{"$f":"_xlfn.IFNA(VLOOKUP(\"DC\",Boilers_Coal!$A$9:$H$60,3),\"N/A\")","v":0.12},{"$f":"_xlfn.IFNA(VLOOKUP(\"MD\",Boilers_Coal!$A$9:$H$60,3),\"N/A\")","v":"0.38 to 1.0 depending on boiler type"},{"$f":"_xlfn.IFNA(VLOOKUP(\"MA\",Boilers_Coal!$A$9:$H$60,3),\"N/A\")","v":0.43},{"$f":"_xlfn.IFNA(VLOOKUP(\"NJ\",Boilers_Coal!$A$9:$H$60,3),\"N/A\")","v":"no limit"},{"$f":"_xlfn.IFNA(VLOOKUP(\"NY\",Boilers_Coal!$A$9:$H$60,3),\"N/A\")","v":"No limits"},{"$f":"_xlfn.IFNA(VLOOKUP(\"PA\",Boilers_Coal!$A$9:$H$60,3),\"N/A\")","v":"0.45 lbs/MMBtu"},{"$f":"_xlfn.IFNA(VLOOKUP(\"RI\",Boilers_Coal!$A$9:$H$60,3),\"N/A\")","v":"no limit"}]
[null,null,null,null,null,null,"Averaging Period",{"$f":"_xlfn.IFNA(VLOOKUP(\"CT\",Boilers_Coal!$A$9:$H$60,4),\"N/A\")","v":"Daily block average."},{"$f":"_xlfn.IFNA(VLOOKUP(\"DC\",Boilers_Coal!$A$9:$H$60,4),\"N/A\")","v":"calendar day average"},{"$f":"_xlfn.IFNA(VLOOKUP(\"MD\",Boilers_Coal!$A$9:$H$60,4),\"N/A\")","v":"30 day rolling"},{"$f":"_xlfn.IFNA(VLOOKUP(\"MA\",Boilers_Coal!$A$9:$H$60,4),\"N/A\")","v":"1 hr"},{"$f":"_xlfn.IFNA(VLOOKUP(\"NJ\",Boilers_Coal!$A$9:$H$60,4),\"N/A\")","v":"not applicable"},{"$f":"_xlfn.IFNA(VLOOKUP(\"NY\",Boilers_Coal!$A$9:$H$60,4),\"N/A\")","v":"not applicable"},{"$f":"_xlfn.IFNA(VLOOKUP(\"PA\",Boilers_Coal!$A$9:$H$60,4),\"N/A\")","v":"Daily, if CEMS"},{"$f":"_xlfn.IFNA(VLOOKUP(\"RI\",Boilers_Coal!$A$9:$H$60,4),\"N/A\")","v":"not applicable"}]
[null,null,null,null,null,"100-125 (mmBtu/hr)","NOx Limit",{"$f":"_xlfn.IFNA(VLOOKUP(\"CT\",Boilers_Coal!$A$8:$H$60,5),\"N/A\")","v":" 0.28 lb/MMBtu (Through May 30, 2023),  0.12 lb/MMBtu (Beginning June 1, 2023).  Ozone season and non-ozone season limits also apply.  "},{"$f":"_xlfn.IFNA(VLOOKUP(\"DC\",Boilers_Coal!$A$8:$H$60,5),\"N/A\")","v":0.12},{"$f":"_xlfn.IFNA(VLOOKUP(\"MD\",Boilers_Coal!$A$8:$H$60,5),\"N/A\")","v":0.65},{"$f":"_xlfn.IFNA(VLOOKUP(\"MA\",Boilers_Coal!$A$8:$H$60,5),\"N/A\")","v":0.12},{"$f":"_xlfn.IFNA(VLOOKUP(\"NJ\",Boilers_Coal!$A$8:$H$60,5),\"N/A\")","v":"no limit"},{"$f":"_xlfn.IFNA(VLOOKUP(\"NY\",Boilers_Coal!$A$8:$H$60,5),\"N/A\")","v":"0.08 to 0.20  lbs/MMBtu"},{"$f":"_xlfn.IFNA(VLOOKUP(\"PA\",Boilers_Coal!$A$8:$H$60,5),\"N/A\")","v":"0.45 lbs/MMBtu"},{"$f":"_xlfn.IFNA(VLOOKUP(\"RI\",Boilers_Coal!$A$8:$H$60,5),\"N/A\")","v":"no limit"}]
[null,null,null,null,null,null,"Averaging Period",{"$f":"_xlfn.IFNA(VLOOKUP(\"CT\",Boilers_Coal!$A$8:$H$60,6),\"N/A\")","v":"Daily block average."},{"$f":"_xlfn.IFNA(VLOOKUP(\"DC\",Boilers_Coal!$A$8:$H$60,6),\"N/A\")","v":"calendar day average"},{"$f":"_xlfn.IFNA(VLOOKUP(\"MD\",Boilers_Coal!$A$8:$H$60,6),\"N/A\")","v":"30 day rolling average"},{"$f":"_xlfn.IFNA(VLOOKUP(\"MA\",Boilers_Coal!$A$8:$H$60,6),\"N/A\")","v":"1 hr"},{"$f":"_xlfn.IFNA(VLOOKUP(\"NJ\",Boilers_Coal!$A$8:$H$60,6),\"N/A\")","v":"not applicable"},{"$f":"_xlfn.IFNA(VLOOKUP(\"NY\",Boilers_Coal!$A$8:$H$60,6),\"N/A\")","v":"With CEM - 24 hour ozone season/ 30 day non-ozone season wo/CEM - 1-hour"},{"$f":"_xlfn.IFNA(VLOOKUP(\"PA\",Boilers_Coal!$A$8:$H$60,6),\"N/A\")","v":"Daily, if CEMS. "},{"$f":"_xlfn.IFNA(VLOOKUP(\"RI\",Boilers_Coal!$A$8:$H$60,6),\"N/A\")","v":"not applicable"}]
[null,null,null,null,null,">250 (mmBtu/hr)","NOx Limit",{"$f":"_xlfn.IFNA(VLOOKUP(\"CT\",Boilers_Coal!$A$8:$H$60,7),\"N/A\")","v":" 0.28 lb/MMBtu (Through May 30, 2023),  0.12 lb/MMBtu (Beginning June 1, 2023).  Ozone season and non-ozone season limits also apply. "},{"$f":"_xlfn.IFNA(VLOOKUP(\"DC\",Boilers_Coal!$A$8:$H$60,7),\"N/A\")","v":0.12},{"$f":"_xlfn.IFNA(VLOOKUP(\"MD\",Boilers_Coal!$A$8:$H$60,7),\"N/A\")","v":"0.45 to 0.8 depending on boiler type"},{"$f":"_xlfn.IFNA(VLOOKUP(\"MA\",Boilers_Coal!$A$8:$H$60,7),\"N/A\")","v":0.12},{"$f":"_xlfn.IFNA(VLOOKUP(\"NJ\",Boilers_Coal!$A$8:$H$60,7),\"N/A\")","v":"1.50 Lb/MWH "},{"$f":"_xlfn.IFNA(VLOOKUP(\"NY\",Boilers_Coal!$A$8:$H$60,7),\"N/A\")","v":"0.08 to 0.20 lbs/MMBtu"},{"$f":"_xlfn.IFNA(VLOOKUP(\"PA\",Boilers_Coal!$A$8:$H$60,7),\"N/A\")","v":"Boilers (Case-by-case); CFB (0.16 lbs/MMBtu)"},{"$f":"_xlfn.IFNA(VLOOKUP(\"RI\",Boilers_Coal!$A$8:$H$60,7),\"N/A\")","v":"no limit"}]
{"$rows_left_out":19}
{"sheet":"VOCs Limits Summary","index":2,"n_rows":17,"n_cols":19,"rows_kept":17,"cut":false,"hidden":false,"merged":[[9,4,10,4],[11,4,12,4],[13,4,14,4],[0,4,0,5],[1,4,5,4],[6,4,7,4]]}
[null,null,null,null,"Source/Phase",null,"CT","DE","DC","ME","MD","MA","NH","NJ","NY","PA","RI","VT","VA"]
[null,null,null,null,"Consumer Products",{"$f":"INDEX(Consumer_Products[#Headers],2)","v":"Phase I 2001"},{"$f":"_xlfn.IFNA(VLOOKUP(G1, Consumer_Products[], MATCH(F2, Consumer_Products[#Headers],0), FALSE),\"N/A\")","v":"Effective"},{"$f":"_xlfn.IFNA(VLOOKUP(H1, Consumer_Products[], MATCH(F2, Consumer_Products[#Headers],0), FALSE),\"N/A\")","v":"Effective"},{"$f":"_xlfn.IFNA(VLOOKUP(I1, Consumer_Products[], MATCH(F2, Consumer_Products[#Headers],0), FALSE),\"N/A\")","v":"Effective"},{"$f":"_xlfn.IFNA(VLOOKUP(J1, Consumer_Products[], MATCH(F2, Consumer_Products[#Headers],0), FALSE),\"N/A\")","v":"Effective "},{"$f":"_xlfn.IFNA(VLOOKUP(K1, Consumer_Products[], MATCH(F2, Consumer_Products[#Headers],0), FALSE),\"N/A\")","v":"Effective"},{"$f":"_xlfn.IFNA(VLOOKUP(L1, Consumer_Products[], MATCH(F2, Consumer_Products[#Headers],0), FALSE),\"N/A\")","v":"Effective "},{"$f":"_xlfn.IFNA(VLOOKUP(M1, Consumer_Products[], MATCH(F2, Consumer_Products[#Headers],0), FALSE),\"N/A\")","v":"Effective"},{"$f":"_xlfn.IFNA(VLOOKUP(N1, Consumer_Products[], MATCH(F2, Consumer_Products[#Headers],0), FALSE),\"N/A\")","v":"Effective "},{"$f":"_xlfn.IFNA(VLOOKUP(O1, Consumer_Products[], MATCH(F2, Consumer_Products[#Headers],0), FALSE),\"N/A\")","v":"Effective"},{"$f":"_xlfn.IFNA(VLOOKUP(P1, Consumer_Products[], MATCH(F2, Consumer_Products[#Headers],0), FALSE),\"N/A\")","v":"Effective "},{"$f":"_xlfn.IFNA(VLOOKUP(Q1, Consumer_Products[], MATCH(F2, Consumer_Products[#Headers],0), FALSE),\"N/A\")","v":"Effective "},{"$f":"_xlfn.IFNA(VLOOKUP(R1, Consumer_Products[], MATCH(F2, Consumer_Products[#Headers],0), FALSE),\"N/A\")","v":"Not Enacted"},{"$f":"_xlfn.IFNA(VLOOKUP(S1, Consumer_Products[], MATCH(F2, Consumer_Products[#Headers],0), FALSE),\"N/A\")","v":"Effective"}]
[null,null,null,null,null,{"$f":"INDEX(Consumer_Products[#Headers],3)","v":"Phase II 2006"},{"$f":"_xlfn.IFNA(VLOOKUP(G1, Consumer_Products[], MATCH(F3, Consumer_Products[#Headers],0), FALSE),\"N/A\")","v":"Effective"},{"$f":"_xlfn.IFNA(VLOOKUP(H1, Consumer_Products[], MATCH(F3, Consumer_Products[#Headers],0), FALSE),\"N/A\")","v":"Effective"},{"$f":"_xlfn.IFNA(VLOOKUP(I1, Consumer_Products[], MATCH(F3, Consumer_Products[#Headers],0), FALSE),\"N/A\")","v":"Effective"},{"$f":"_xlfn.IFNA(VLOOKUP(J1, Consumer_Products[], MATCH(F3, Consumer_Products[#Headers],0), FALSE),\"N/A\")","v":"Effective "},{"$f":"_xlfn.IFNA(VLOOKUP(K1, Consumer_Products[], MATCH(F3, Consumer_Products[#Headers],0), FALSE),\"N/A\")","v":"Effective"},{"$f":"_xlfn.IFNA(VLOOKUP(L1, Consumer_Products[], MATCH(F3, Consumer_Products[#Headers],0), FALSE),\"N/A\")","v":"Effective"},{"$f":"_xlfn.IFNA(VLOOKUP(M1, Consumer_Products[], MATCH(F3, Consumer_Products[#Headers],0), FALSE),\"N/A\")","v":"Effective "},{"$f":"_xlfn.IFNA(VLOOKUP(N1, Consumer_Products[], MATCH(F3, Consumer_Products[#Headers],0), FALSE),\"N/A\")","v":"Effective"},{"$f":"_xlfn.IFNA(VLOOKUP(O1, Consumer_Products[], MATCH(F3, Consumer_Products[#Headers],0), FALSE),\"N/A\")","v":"Effective"},{"$f":"_xlfn.IFNA(VLOOKUP(P1, Consumer_Products[], MATCH(F3, Consumer_Products[#Headers],0), FALSE),\"N/A\")","v":"Effective "},{"$f":"_xlfn.IFNA(VLOOKUP(Q1, Consumer_Products[], MATCH(F3, Consumer_Products[#Headers],0), FALSE),\"N/A\")","v":"Effective "},{"$f":"_xlfn.IFNA(VLOOKUP(R1, Consumer_Products[], MATCH(F3, Consumer_Products[#Headers],0), FALSE),\"N/A\")","v":"Not Enacted"},{"$f":"_xlfn.IFNA(VLOOKUP(S1, Consumer_Products[], MATCH(F3, Consumer_Products[#Headers],0), FALSE),\"N/A\")","v":"Effective  "}]
[null,null,null,null,null,{"$f":"INDEX(Consumer_Products[#Headers],4)","v":"Phase III 2010"},{"$f":"_xlfn.IFNA(VLOOKUP(G1, Consumer_Products[], MATCH(F4, Consumer_Products[#Headers],0), FALSE),\"N/A\")","v":"Effective"},{"$f":"_xlfn.IFNA(VLOOKUP(H1, Consumer_Products[], MATCH(F4, Consumer_Products[#Headers],0), FALSE),\"N/A\")","v":"Effective"},{"$f":"_xlfn.IFNA(VLOOKUP(I1, Consumer_Products[], MATCH(F4, Consumer_Products[#Headers],0), FALSE),\"N/A\")","v":"Not Enacted"},{"$f":"_xlfn.IFNA(VLOOKUP(J1, Consumer_Products[], MATCH(F4, Consumer_Products[#Headers],0), FALSE),\"N/A\")","v":"Not Enacted"},{"$f":"_xlfn.IFNA(VLOOKUP(K1, Consumer_Products[], MATCH(F4, Consumer_Products[#Headers],0), FALSE),\"N/A\")","v":"Effective "},{"$f":"_xlfn.IFNA(VLOOKUP(L1, Consumer_Products[], MATCH(F4, Consumer_Products[#Headers],0), FALSE),\"N/A\")","v":"Not Enacted"},{"$f":"_xlfn.IFNA(VLOOKUP(M1, Consumer_Products[], MATCH(F4, Consumer_Products[#Headers],0), FALSE),\"N/A\")","v":"Effective"},{"$f":"_xlfn.IFNA(VLOOKUP(N1, Consumer_Products[], MATCH(F4, Consumer_Products[#Headers],0), FALSE),\"N/A\")","v":"Not Enacted"},{"$f":"_xlfn.IFNA(VLOOKUP(O1, Consumer_Products[], MATCH(F4, Consumer_Products[#Headers],0), FALSE),\"N/A\")","v":"Effective 1/1/2022"},{"$f":"_xlfn.IFNA(VLOOKUP(P1, Consumer_Products[], MATCH(F4, Consumer_Products[#Headers],0), FALSE),\"N/A\")","v":"Not Enacted"},{"$f":"_xlfn.IFNA(VLOOKUP(Q1, Consumer_Products[], MATCH(F4, Consumer_Products[#Headers],0), FALSE),\"N/A\")","v":"Effective "},{"$f":"_xlfn.IFNA(VLOOKUP(R1, Consumer_Products[], MATCH(F4, Consumer_Products[#Headers],0), FALSE),\"N/A\")","v":"Not Enacted"},{"$f":"_xlfn.IFNA(VLOOKUP(S1, Consumer_Products[], MATCH(F4, Consumer_Products[#Headers],0), FALSE),\"N/A\")","v":"Not Enacted"}]
[null,null,null,null,null,{"$f":"INDEX(Consumer_Products[#Headers],5)","v":"Phase IV 2012/2013"},{"$f":"_xlfn.IFNA(VLOOKUP(G1, Consumer_Products[], MATCH(F5, Consumer_Products[#Headers],0), FALSE),\"N/A\")","v":"Effective"},{"$f":"_xlfn.IFNA(VLOOKUP(H1, Consumer_Products[], MATCH(F5, Consumer_Products[#Headers],0), FALSE),\"N/A\")","v":"Effective"},{"$f":"_xlfn.IFNA(VLOOKUP(I1, Consumer_Products[], MATCH(F5, Consumer_Products[#Headers],0), FALSE),\"N/A\")","v":"Not Enacted"},{"$f":"_xlfn.IFNA(VLOOKUP(J1, Consumer_Products[], MATCH(F5, Consumer_Products[#Headers],0), FALSE),\"N/A\")","v":"Not Enacted"},{"$f":"_xlfn.IFNA(VLOOKUP(K1, Consumer_Products[], MATCH(F5, Consumer_Products[#Headers],0), FALSE),\"N/A\")","v":"Effective "},{"$f":"_xlfn.IFNA(VLOOKUP(L1, Consumer_Products[], MATCH(F5, Consumer_Products[#Headers],0), FALSE),\"N/A\")","v":"Effective (partial)"},{"$f":"_xlfn.IFNA(VLOOKUP(M1, Consumer_Products[], MATCH(F5, Consumer_Products[#Headers],0), FALSE),\"N/A\")","v":"Effective "},{"$f":"_xlfn.IFNA(VLOOKUP(N1, Consumer_Products[], MATCH(F5, Consumer_Products[#Headers],0), FALSE),\"N/A\")","v":"Not Enacted"},{"$f":"_xlfn.IFNA(VLOOKUP(O1, Consumer_Products[], MATCH(F5, Consumer_Products[#Headers],0), FALSE),\"N/A\")","v":"Effective, Compliance Date 1/1/2022"},{"$f":"_xlfn.IFNA(VLOOKUP(P1, Consumer_Products[], MATCH(F5, Consumer_Products[#Headers],0), FALSE),\"N/A\")","v":"Not Enacted"},{"$f":"_xlfn.IFNA(VLOOKUP(Q1, Consumer_Products[], MATCH(F5, Consumer_Products[#Headers],0), FALSE),\"N/A\")","v":"Effective "},{"$f":"_xlfn.IFNA(VLOOKUP(R1, Consumer_Products[], MATCH(F5, Consumer_Products[#Headers],0), FALSE),\"N/A\")","v":"Not Enacted"},{"$f":"_xlfn.IFNA(VLOOKUP(S1, Consumer_Products[], MATCH(F5, Consumer_Products[#Headers],0), FALSE),\"N/A\")","v":"Not Enacted"}]
[null,null,null,null,null,{"$f":"INDEX(Consumer_Products[#Headers],6)","v":"Phase V 2018 (RTG)"},{"$f":"_xlfn.IFNA(VLOOKUP(G1, Consumer_Products[], MATCH(F6, Consumer_Products[#Headers],0), FALSE),\"N/A\")","v":"Not Enacted"},{"$f":"_xlfn.IFNA(VLOOKUP(H1, Consumer_Products[], MATCH(F6, Consumer_Products[#Headers],0), FALSE),\"N/A\")","v":"Not Enacted"},{"$f":"_xlfn.IFNA(VLOOKUP(I1, Consumer_Products[], MATCH(F6, Consumer_Products[#Headers],0), FALSE),\"N/A\")","v":"Not Enacted"},{"$f":"_xlfn.IFNA(VLOOKUP(J1, Consumer_Products[], MATCH(F6, Consumer_Products[#Headers],0), FALSE),\"N/A\")","v":"Not Enacted"},{"$f":"_xlfn.IFNA(VLOOKUP(K1, Consumer_Products[], MATCH(F6, Consumer_Products[#Headers],0), FALSE),\"N/A\")","v":"Not Enacted"},{"$f":"_xlfn.IFNA(VLOOKUP(L1, Consumer_Products[], MATCH(F6, Consumer_Products[#Headers],0), FALSE),\"N/A\")","v":"Not Enacted"},{"$f":"_xlfn.IFNA(VLOOKUP(M1, Consumer_Products[], MATCH(F6, Consumer_Products[#Headers],0), FALSE),\"N/A\")","v":"Not Enacted"},{"$f":"_xlfn.IFNA(VLOOKUP(N1, Consumer_Products[], MATCH(F6, Consumer_Products[#Headers],0), FALSE),\"N/A\")","v":"Not Enacted"},{"$f":"_xlfn.IFNA(VLOOKUP(O1, Consumer_Products[], MATCH(F6, Consumer_Products[#Headers],0), FALSE),\"N/A\")","v":"Not Enacted"},{"$f":"_xlfn.IFNA(VLOOKUP(P1, Consumer_Products[], MATCH(F6, Consumer_Products[#Headers],0), FALSE),\"N/A\")","v":"Not Enacted"},{"$f":"_xlfn.IFNA(VLOOKUP(Q1, Consumer_Products[], MATCH(F6, Consumer_Products[#Headers],0), FALSE),\"N/A\")","v":"Not Enacted"},{"$f":"_xlfn.IFNA(VLOOKUP(R1, Consumer_Products[], MATCH(F6, Consumer_Products[#Headers],0), FALSE),\"N/A\")","v":"Not Enacted"},{"$f":"_xlfn.IFNA(VLOOKUP(S1, Consumer_Products[], MATCH(F6, Consumer_Products[#Headers],0), FALSE),\"N/A\")","v":"Not Enacted"}]
{"$rows_left_out":12}
{"sheet":"RACT summary","index":3,"n_rows":23,"n_cols":16,"rows_kept":23,"cut":false,"hidden":false,"merged":[[6,15,7,15],[17,0,19,0],[17,5,17,13],[0,0,0,5],[2,0,2,5],[4,0,4,1],[6,5,6,13],[6,14,7,14]]}
["State NOx RACT Rules Summary"]
["updated 3_2023"]
[]
["Link to Instructions",null,null,"updated March 27, 2023"]
[]
[]
{"$rows_left_out":18}
{"sheet":"Boilers_Coal","index":4,"n_rows":21,"n_cols":11,"rows_kept":21,"cut":false,"hidden":false,"merged":[[5,10,6,10],[6,2,6,3],[6,4,6,5],[6,6,6,7],[5,0,7,0],[5,1,7,1],[5,8,7,8],[5,9,7,9],[5,2,5,7]]}
[]
["Summary Table: Coal-fired Boilers"]
["Ranges shown are for firing type (wall, tangential, etc.)","updated March 27, 2023"]
[]
[]
["State","Geographic Area","NOx Limits and Averaging Periods",null,null,null,null,null," RACT REGULATIONS","State Contacts","Comments"]
{"$rows_left_out":16}
{"sheet":"Boilers_Nat_Gas","index":5,"n_rows":21,"n_cols":11,"rows_kept":21,"cut":false,"hidden":false,"merged":[[5,0,7,0],[5,1,7,1],[5,8,7,8],[5,9,7,9],[5,10,6,10],[6,2,6,3],[6,4,6,5],[6,6,6,7],[5,2,5,7]]}
[]
["Summary Table: Natural Gas-fired Boilers"]
["Ranges shown are for firing type (wall, tangential, etc.)"]
[null,"updated March 27, 2023"]
[]
["State","Geographic Area","NOx Limits and Averaging Periods",null,null,null,null,null," RACT REGULATIONS","State Contacts","Comments"]
{"$rows_left_out":16}
{"sheet":"Boilers_Oil","index":6,"n_rows":21,"n_cols":12,"rows_kept":21,"cut":false,"hidden":false,"merged":[[5,10,6,10],[6,2,6,3],[6,4,6,5],[6,6,6,7],[5,0,7,0],[5,1,7,1],[5,2,5,7],[5,8,7,8],[5,9,7,9]]}
[]
["Summary Table: Oil-fired Boilers"]
["Ranges shown are for firing type (wall, tangential, etc.)"]
[null,"updated March 27, 2023"]
[]
["State","Geographic Area","NOx Limits and Averaging Periods",null,null,null,null,null," RACT REGULATIONS","State Contacts","Comments"]
{"$rows_left_out":16}
{"sheet":"Combustion_Gas_Turbines","index":7,"n_rows":39,"n_cols":13,"rows_kept":39,"cut":false,"hidden":false,"merged":[[4,10,6,10],[4,11,6,11],[4,12,6,12],[5,2,5,3],[5,4,5,5],[5,6,5,7],[5,8,5,9],[39,0,39,8],[40,0,40,8],[4,0,6,0],[4,1,6,1],[4,2,4,9],[31,1,31,9]]}
[]
["Summary Table: Combustion Turbine Engines"]
["See \"NOx RACT Rules\" tab for additional information ",null,null,"updated March 27, 2023"]
[]
["State","Geographic Area","NOx Limits and Averaging Periods",null,null,null,null,null,null,null," RACT REGULATIONS","State Contacts","Comments"]
[null,null,"Simple Cycle >25 MW Gas-fired",null,"Simple Cycle >25 MW Oil-fired",null,"Combined Cycle >25 MW Gas-fired",null,"Combined Cycle >25 MW Oil-fired"]
{"$rows_left_out":34}
{"sheet":"IC_Engines","index":8,"n_rows":38,"n_cols":13,"rows_kept":38,"cut":false,"hidden":false,"merged":[[4,11,6,11],[4,12,6,12],[5,2,5,3],[5,4,5,5],[5,6,5,7],[5,8,5,9],[38,0,38,8],[4,0,6,0],[4,1,6,1],[4,2,4,9],[4,10,6,10]]}
[]
["Summary Table: IC Engines > 500 hp"]
["See \"NOx RACT Rules\" tab for additional information "]
[]
["State","Geographic Area","NOx Limits and Averaging Periods",null,null,null,null,null,null,null," RACT REGULATIONS","State Contacts","Comments"]
[null,null,"Gas-fired, Lean Burn",null,"Gas-fired, Rich Burn",null,"Diesel",null,"Dual Fuel"]
{"$rows_left_out":33}
{"sheet":"NOx_MWC","index":9,"n_rows":35,"n_cols":9,"rows_kept":35,"cut":false,"hidden":false,"merged":[[26,1,26,6],[14,6,17,6],[11,1,12,1],[11,2,12,2],[11,3,12,3],[11,5,12,5],[24,1,24,5],[20,0,22,0],[9,7,12,7],[7,1,7,5],[8,1,8,5],[9,4,12,4],[14,10,17,15],[5,8,6,8],[5,7,6,7],[14,8,17,8],[9,0,12,0],[9,6,12,6],[14,7,17,7],[14,0,17,0]]}
[]
["Summary Table: Municipal Waste Combustors"]
[null,"updated March 27, 2023"]
[]
["State","MWC Type","NOx limit  (ppmvd @7% O2)","NOx Averaging  Time","Ammonia Slip Limit (ppmvd @7% O2)","NOx Standards Regulation"," RACT REGULATIONS","State Contacts","Comments"]
["CT","add type if applicable","150 for all","24-hour daily average","20a","RCSA section 22a-174-38","Revised RCSA section 22a-174-38.  https://eregulations.ct.gov/eRegsPortal/Browse/RCSA?id=Title%2022a|22a-174|22a-174-38|22a-174-38","Merrily Gere, 860 424 3416, Merrily.Gere@CT.gov; ","aCurrent Standard as of 08/02/16;  "]
{"$rows_left_out":30}
{"sheet":"Cement_Kilns","index":10,"n_rows":41,"n_cols":12,"rows_kept":41,"cut":false,"hidden":false,"merged":[[4,0,6,0],[4,1,4,8],[4,9,6,9],[4,10,6,10],[4,11,6,11],[5,1,5,2],[5,3,5,4],[5,5,5,6],[5,7,5,8],[7,1,7,7],[18,1,18,7],[9,1,9,9],[10,1,10,9],[11,1,11,9],[19,1,19,7],[38,1,38,7],[39,1,39,7],[40,1,40,7],[25,1,25,7],[27,1,27,7],[29,1,29,7],[33,1,33,7],[34,1,34,7],[26,1,26,7],[32,1,32,7]]}
[]
["Summary Table: Cement Kilns "]
[null,"updated March 27, 2023"]
[]
["State","NOx Limits and Averaging Periods",null,null,null,null,null,null,null," RACT REGULATIONS","State Contacts","Comments"]
[null,"Long Dry",null,"Long Wet",null,"Pre-heater",null,"Pre-calciner"]
{"$rows_left_out":36}
{"sheet":"Hot_Mix_Asphalt_Production","index":11,"n_rows":39,"n_cols":10,"rows_kept":39,"cut":false,"hidden":false,"merged":[[4,8,6,8],[4,9,6,9],[5,1,5,2],[5,3,5,4],[5,5,5,6],[4,1,4,5],[4,0,6,0],[4,7,6,7],[27,1,27,5],[35,1,35,5],[36,1,36,5],[31,1,31,5],[11,1,11,5],[9,1,9,5],[19,1,19,6]]}
[]
["Summary Table: Hot Mix Asphalt Production Plants"]
["See \"NOx RACT Rules\" tab for additional information ",null,null,null,"updated March 27, 2023"]
[]
["State","NOx Limits and Averaging Periods",null,null,null,null,null," RACT REGULATIONS","State Contacts","Comments"]
[null,"Natural Gas ",null,"No. 2  Oil ",null,"Other Oils"]
{"$rows_left_out":34}
{"sheet":"Glass_Furnaces","index":12,"n_rows":20,"n_cols":8,"rows_kept":20,"cut":false,"hidden":false,"merged":[[18,1,18,5],[19,1,19,5],[17,1,17,5],[4,1,4,3],[8,1,8,5],[7,1,7,5],[6,1,6,5],[11,1,11,5],[12,1,12,4],[10,1,10,4]]}
[]
["Summary Table: Glass Furnaces"]
[null,null,null,null,null,null,"updated March 27, 2023"]
[]
[null,"NOx Limit ",null,null,null," RACT REGULATIONS","State Contacts","Comments"]
["State","Facility","Emission rate","Averaging Time","Technology"]
{"$rows_left_out":15}
{"sheet":"NatGas_Pipeline_Compressors","index":13,"n_rows":19,"n_cols":5,"rows_kept":19,"cut":false,"hidden":false,"merged":[]}
[]
["Summary Table: Natural Gas Pipeline Compressors"]
[null,"updated March 27, 2023"]
[]
[null,"NOx Limit "," RACT REGULATIONS","State Contacts","Comments"]
["State"]
{"$rows_left_out":14}
{"sheet":"VOCs","index":14,"n_rows":16,"n_cols":31,"rows_kept":16,"cut":false,"hidden":false,"merged":[[0,26,0,27],[0,29,0,30],[0,0,0,5],[0,7,0,9],[0,11,0,12],[0,14,0,16],[0,18,0,20],[0,22,0,24]]}
["Consumer Products",null,null,null,null,null,null,"AIM",null,null,null,"Asphalt Paving",null,null,"PFCs",null,null,null,"MERR",null,null,null,"Solvent Degreasing",null,null,null,"ICI Adhesives and Sealants",null,null,"Large Above Ground VOC Storage Tanks"]
["State","Phase I 2001","Phase II 2006","Phase III 2010","Phase IV 2012/2013","Phase V 2018 (RTG)",null,"State","Phase I 2001","Phase II 2011",null,"State","6/7/2006",null,"State","Phase I 2001","Phase II 2006",null,"State","Phase I 2001","Phase II 2009/2011",null,"State","Phase I 2001","Phase II 2012",null,"State","2006",null,"State","2010"]
["Source Type","Area","Area","Area","Area","Area",null,"Source Type","Area","Area",null,"Source Type","Area",null,"Source Type","Area","Area",null,"Source Type","Mostly Area, Some Point","Mostly Area, Some Point",null,"Source Type","Area and Point","Mostly Area, Some Point",null,"Source Type","Mostly Area, Some Point",null,"Source Type","Point"]
["CT","Effective","Effective","Effective","Effective","Not Enacted",null,"CT","Effective","Effective",null,"CT","Effective",null,"CT","Federal","Federal",null,"CT","Effective","Not enacted",null,"CT","Effective","Not enacted",null,"CT","Effective",null,"CT","Effective"]
["DC","Effective","Effective","Not Enacted","Not Enacted","Not Enacted",null,"DC","Effective","Not Enacted",null,"DC","N/A",null,"DC","Effective","Effective",null,"DC","Effective","Effective",null,"DC","Effective Similar Rule","Not enacted",null,"DC","Effective",null,"DC","N/A"]
["DE","Effective","Effective","Effective","Effective","Not Enacted",null,"DE","Effective","Effective",null,"DE","Effective Similar Rule",null,"DE","Federal","Federal",null,"DE","Effective","Effective",null,"DE","Effective","Effective 8/11/21, Compliance Date 8/11/22",null,"DE","Effective",null,"DE","Not enacted"]
{"$rows_left_out":10}